"@ViewChild takes 2 arguments error" Code Answer's

You're definitely familiar with the best coding language TypeScript that developers use to develop their projects and they get all their queries like "@ViewChild takes 2 arguments error" answered properly. Developers are finding an appropriate answer about @ViewChild takes 2 arguments error related to the TypeScript coding language. By visiting this online portal developers get answers concerning TypeScript codes question like @ViewChild takes 2 arguments error. Enter your desired code related query in the search bar and get every piece of information about TypeScript code related question on @ViewChild takes 2 arguments error. 

@ViewChild takes 2 arguments error

By Clever CowfishClever Cowfish on Jan 17, 2020
 @ViewChild(ChildDirective, {static: false}) Component

Source: stackoverflow.com

Add Comment

0

All those coders who are working on the TypeScript based application and are stuck on @ViewChild takes 2 arguments error can get a collection of related answers to their query. Programmers need to enter their query on @ViewChild takes 2 arguments error related to TypeScript code and they'll get their ambiguities clear immediately. On our webpage, there are tutorials about @ViewChild takes 2 arguments error for the programmers working on TypeScript code while coding their module. Coders are also allowed to rectify already present answers of @ViewChild takes 2 arguments error while working on the TypeScript language code. Developers can add up suggestions if they deem fit any other answer relating to "@ViewChild takes 2 arguments error". Visit this developer's friendly online web community, CodeProZone, and get your queries like @ViewChild takes 2 arguments error resolved professionally and stay updated to the latest TypeScript updates. 

TypeScript answers related to "@ViewChild takes 2 arguments error"

View All TypeScript queries

TypeScript queries related to "@ViewChild takes 2 arguments error"

@ViewChild takes 2 arguments error expected 2 arguments but got 1. viewchild angular how to make a class that takes no arguments in python how to fix takes 0 positional arguments but 2 were given builtins.TypeError: choice() takes 2 positional arguments but 4 were given TypeError: autodiscover_tasks() takes at least 2 arguments (1 given) celery angular viewchild an argument for opts was not provided Write a function that takes in two sorted arrays and returns a new array with all elements sorted not using array method sort. get arguments from url flask optional arguments c# command line arguments in c how to pass arguments to filter function in python The method 'MultiHeaders.set' has fewer named arguments than those of overridden method 'HttpHeaders.set'. giving arguments to main function in c how to add multiple arguments in discord commands rewrite Write a shell script that accepts a file name starting and ending line numbers as arguments and displays all the lines between the given line numbers python list arguments of function No type arguments expected for interface ListAdapter kotlin toast.makeText non of the arguments supplied function should take three arguments - operation(string/char), value1(number), value2(number). rscript arguments input How many arguments does a call to the Math.sqrt method have? Could not find method kapt() for arguments [androidx.room:room-compiler:2.3.0] on object of type org.gradle.api.internal.artifacts.dsl.dependencies.DefaultDependencyHandler. err wrong number of arguments for 'set' command redis windows how to call a function in a macro with variadic arguments c++ how to pass node arguments in nextjs how to take list as command line arguments in python minikube arguments --cpus can we use function overloading and default arguments at same time in c++ rake pass multiple arguments to task flutter too many positional arguments 0 expected but 1 found not enough input arguments matlab to find max and min using command line arguments in java how to use command line arguments in java eclipse No type arguments expected for interface Callback 1 positional arguments expected but 2 were given pass command line arguments with spaces cmd c++ too few arguments in function call python arbitrary arguments *args mcqs callback with arguments flutter 2 positional arguments but 3 were given pass arguments ipython python fancy way to get arguments from the command line ERROR in node_modules/rxjs/internal/types.d.ts(81,44): error TS1005: ';' expected. ng idle issue ERROR in node_modules/@ng-idle/core/lib/eventtargetinterruptsource.d.ts(29,9): error TS1086: An accessor cannot be declared in an ambient context. Error: ConfigMap in version "v1" cannot be handled as a ConfigMap: v1.ConfigMap.Data: ReadString: expects " or n, but found f, error found in #10 byte of ... Uncaught Error: Template parse errors: Can't bind to 'ngModel' react-scripts start error error TS2307: Cannot find module 'path' or its corresponding type declarations. Parsing error: "parserOptions.project" has been set for @typescript-eslint/parser. tslint shows double quotes error prettier error TS2503: Cannot find namespace 'google'. 10 @Input() mapOptions: google.maps.MapOptions; error TS2304: Cannot find name 'EventEmitter'. Request exceeded the limit of 10 internal redirects due to probable configuration error. Use 'LimitInternalRecursion' to increase the limit if necessary error TS2307: Cannot find module '@angular/cdk/bidi'. Cannot show Automatic Strong Passwords for app bundleID: com.williamyeung.gameofchats due to error: iCloud Keychain is disabled formik error focus mysql error count(): Parameter must be an array or an object that implements Countable error TS2304: Cannot find name 'beforeEach'. error: either specify it explicitly with --sdk_root= or move this package into its expected location: /cmdline-tools/latest/ error TS2304: Cannot find name 'NgForm'. angular error TS2532: Object is possibly 'undefined'. Error: [Immer] An immer producer returned a new value *and* modified its draft. Either return a new value *or* modified request exceeded the limit of 10 internal redirects due to probable configuration error ERROR: Repository not found. fatal: Could not read from remote repository. Please make sure you have the correct access rights and the repository exists. ERROR in The Angular Compiler requires TypeScript >=4.0.0 and ignore typescript error Error: ./src/main.ts Module build failed (from ./node_modules/@ngtools/webpack/src/ivy/index.js): TypeError: Cannot read property 'createUniqueName' of undefined from sklearn.datasets import fetch_mldata error [ERROR] @ionic/app-scripts is required for this command to work properly. @angular/fire/angularfire2.d.ts:37:49 - error TS2344: Type 'T[K]' does not satisfy the constraint '(...args: any) => any node_modules/angularx-flatpickr/flatpickr.module.d.ts:6:64 - error TS2314: Generic type 'ModuleWithProviders' requires 1 type argument(s). CUSTOM_ELEMENTS_SCHEMA error occur while unit testing with jasmine and karma Angular 9 : Error NG2003: No suitable injection token for parameter 'url' of class 'DataService'. Found string error: The method assertThat(T, Matcher Parsing error: Declaration or statement expected Symfony\Component\Debug\Exception\FatalThrowableError Type error: ReflectionFunction::__construct() expects parameter 1 to be string, array given addObjects giving a fatal error when pushing data to algolia "Type error: ReflectionFunction::__construct() expects parameter 1 to be string, array given" assets\scripts\executeevents.cs(236,24): error cs0122: 'objectpool' is inaccessible due to its protection level VS2015 git An error occurred. Detailed message: 1 conflict prevents checkout reach router path typescript error error TS2339: Property 'open' does not exist on type 'MatDialogModule'. Error: Gradle project sync failed. Please fix your project and try again. custom validator ERROR TypeError: "this.myForm.controls.cnfPass is undefined" error TS2307: Cannot find module '@ngx-meta/core'. error: postfix operator toArray needs to be enabled ERROR in The Angular Compiler requires TypeScript >=3.4.0 and

Browse Other Code Languages

CodeProZone